BDBM126895 US8785464, 54
SMILES FC(F)(F)C(=O)NCCCOc1nc(Nc2ccc(cc2)C(=O)NCc2ccccc2)ncc1C(F)(F)F
InChI Key InChIKey=JZBHBCSZMZJCQL-UHFFFAOYSA-N
Data  1 IC50
  Tab Delimited (TSV)   2D SDfile   Computed 3D by Vconf -m prep SDfile
Find this compound or compounds like it in BindingDB:
Activity Spreadsheet -- Enzyme Inhibition Constant Data from BindingDB
Found 1 hit for monomerid = 126895
TargetFocal adhesion kinase 1(Homo sapiens (Human))
Boehringer Ingelheim International
US Patent
LigandPNGBDBM126895(US8785464, 54)
Affinity DataIC50:  3.05E+3nMpH: 7.5Assay Description:This test uses active PTK2 enzyme (Invitrogen Code PV3832) and poly-Glu-Tyr (4:1, Sigma P-0275) as the kinase substrate. The kinase activity is detec...
In DepthDetails US Patent